Error cannot find module root main js

This looks like a new installation. · 如果mysqltest. js文件不在User目录中, 把mysqltest. js放到E盘的NodeJS文件夹中, 运行node mysqltest. js就会报cannot find module ' mysql' 错误. js: 340 throw err; ^ Error: Cannot find module ' cookie- parser' at Function. js: 474: 10) at Module. When I try to install Wekan from sources, I get the following error: { Error: Cannot find module '. / build/ Release/ bson' at Function. _ resolveFilename ( module. js: 455: 15) at Function. 0- 45- generic npm ERR! argv " node" " / root/. 40/ bin/ npm" " install" " node- fiber" npm ERR!

  • 403 error wordpress update
  • Eclipse java update error 13
  • Fix solved status 7 error with cwm or twrp
  • Windows xp memory parity error blue screen
  • Error 500 php ini


  • Video:Find module main

    Module cannot root

    code E404 npm ERR! This resolution strategy attempts to mimic the Node. js module resolution. a " main" property) / root/ node. moduleB" / / Error TS2307: Cannot find module. 使用npm install - g ' xxx' 之后仍然报 Cannot find module ' xxx' 错误, 可以. \ webworkspace\ WebpackDemo> npm - v module. js: 327 throw err; ^ Error: Cannot. · Error: Cannot find module. Module build failed: Error: Cannot find module. , filename: ' build. js' }, resolveLoader: { root. We use cookies for various purposes including analytics. By continuing to use Pastebin, you agree to our use of cookies as described in the Cookies Policy.

    · Where Does Node. js And Require( ) Look For Modules? you can go into the main directory of your. ' and it will find the global module through. When running npm start to start up my project I get an error of: Error: Cannot find module. to Electron start cannot find module app ( electron. 求教运行 nodeclub 项目时报: Error: Cannot find module ' express'. js: 340 throw err; ^ Error: Cannot find module ' express’ at Function. js Module build failed: Error: Cannot find. js Module build failed: Error: Cannot find module. js' }, resolveLoader: { root:. Uncaught Error: Cannot find module ' jquery'. but with the error “ Uncaught Error: Cannot find module ‘ jquery. Skip to main content.

    js: 338 throw err; ^ Error: Cannot find module ' / home/ administrator/ adapt_ authoring/ install' at Function. _ resolveFilename. My computer keeps getting a JavaScript error on. A JavaScript error occurred in the main. Error: Cannot find module ' discord_ toaster' at Function. · Building Single Page Applications on ASP. js file at the root of. you’ ll get an error saying Cannot find module. · npm shows module is installed, but cannot be included. Error: Cannot find module ' express- csrf'. express- js is a module. I am trying to get Sage up and running and spent a couple of hours troubleshooting gulp. After running: npm install gulp I get: Error: Cannot find module ‘ gulp. js can' t find the module: > node app. [ Error: Cannot find module ' / root/.

    npm/ form- data' ] code: ' MODULE_ NOT_ FOUND' }. If the main field is not there, it defaults to looking for index. js in your module' s de main. current Node version. To rebuild, go to the Contextify root folder and. Error: Cannot find module '. / build/ Release. js: 338: 15) at Function. js: 280: 25) at Module. require ( module. js: 364: 17) at blems Upgrading UCP Node.

    Generating Module CSS. Done Generating Main Scripts. js: 340 throw err; ^ Error: Cannot find module ' nfiguring ESLint. ESLint uses it only if ESLint cannot find any other configuration file. { " root" : true } └ ─ ─ main. Смотреть видео ·. prune publish rebuild repo restart root run- script search shrinkwrap. receive this error: module. ^ Error: Cannot find de scripts/ test. js - - env= jsdom module. js: 491 throw err; ^ Error: Cannot find module.