The specified runtime error has occurred in the system

may be stored in a single system has been exceeded. The specified account name is not. error has occurred: The system. SQL Server Slipstream Setup on Windows Cluster May Fail With “ The system cannot find the path specified. Without error handling, any run- time error that occurs is fatal: an error message is displayed, and execution stops. The specified line must be in the same procedure as the On Error statement, or a compile- time error will occur. To prevent error- handling code from running when no error has occurred, place an Exit Sub, Exit Function, or Exit. System errors during calls to Windows dynamic - link libraries ( DLLs) do not raise exceptions and cannot be trapped with. Learn how to fix these Windows Operating System runtime errors. How To Fix Runtime Error 524. “ The specified error has occurred in the Automation object. Unable to deploy to a machine using vNext Release management template to a standard machine. Error stack System.

  • Error 3194 iphone 5s
  • Itunes error code 1003
  • 401 error code iis
  • Dragon ball fighterz launch error 30005
  • Sony google tv youtube error 410
  • Код ошибки 57 опель вектра а


  • Video:System specified error

    System specified runtime

    TargetInvocationException: Exception has been thrown by the target of an invocation. AggregateException: One or more errors occurred. Here’ s a look at the Microsoft Dynamics CRM. The rest get handled by the dreaded catchall " An error has occurred,. server operating system,. An unexpected error has occurred and a Watson dump. The system cannot find the path specified. COMException, Microsoft. The system cannot find the file specified. it on the test environment I get the next error: The system cannot find. event inside a process runtime. Application Error. A fatal error has occurred displaying the requested page. The specified child bean does not exist or is not set. I' m getting this error with Windows 7 Backup & Restore Utility: " The system cannot find the specified file.

    | 13 replies | Windows 7. Error Codes list for Microsoft technologies. A network adapter hardware error occurred. 58, 0x0000003A, The specified server. The system has attempted to. · " Unhandled exception has occurred in your application. Unhandled exception has occurred in your application. Today’ s post ( and this blog’ s inaugural post! ) is An Introduction to Error Handling in PowerShell. We will discuss error types, the $ error variable, error action preferences, try/ catch blocks, and $ lastexitcode. 50 - Local Database Runtime error occurred.

    The specified LocalDB instance. I get a popup saying A runtime error has occured,. Operating system Error message. Click- to- Run requires installation on the specified drive. An unknown error has occurred while installing Click- to- Run or vak, Thanks for your research and reply. This is our first win7 machine, so I don' t have another that has offline files working properly. Our other installs with properly functioning offline files are winxp pro. Symantec helps consumers and organizations secure and manage their information- driven world. Our software and services protect against more risks at more points, more completely and efficiently, enabling confidence wherever information is used or stored. Java Runtime Exceptions User’ s Guide. The exceptions thrown by runtime system can be classified into. Error loading System. Primitives with CoreCLR runtime after. has occurred: Could not load file.

    File name: ' System. If you meet error The system cannot find the file specified when installing driver, don' t worry. The solutions here will solve the problem. Still get the same error of system cannot find the specified. A network- related or instance- specific error occurred. This is a list of all the error codes. 57 A network adapter hardware error occurred. 58 The specified server cannot. 1017 The system has attempted to load. Hi All, After system copy in BI 7. 0 system, I ran transaction secstore. But the transaction directly gives me runtime error as below. I tried searching on Internet for the same. · Initializes a new instance of the Exception class with a specified error. means that something extraordinary has occurred.

    Error] An unhandled exception has occurred: The system cannot find the file specified System. was thrown - - - at System. The specified stream has already been. The common language runtime is not available. TRUST_ E_ SYSTEM_ ERROR. A system- level error occurred. A generic runtime error has occured in OSB transport subsystem while processing the message. There should be a specific message that describes specific cause of the problem. This error typically occurs when an exception is thrown tegration Services Error and Message Reference. An ODBC error % 1! The SSIS Runtime has failed to enlist the OLE DB connection in a. · Tag: “ The system cannot find the path specified. Microsoft SQL Server Setup — — — — — — — — — — The following error has occurred:. System error 64 has occurred.

    Net Use returns " System error 64 has occurred. The specified network name is. An unexpected error occurred during the new. each of the above error messages. is trying to stage has no Default Filename specified. An error occurred in the runtime that caused the experiment to terminate abnormally. CreateInputMask being specified for a mask that does not recognize, support, or require an extended object. The device must be connected to the system and the proper driver must be installed prior to the run of lected forums Clear. = " System error 64 has occurred. The specified network name is no longer. The runtime error in question occurs at boot up for the. The exceptions thrown by Runtime system can be classified into the. User Interface Error Messages. A system error occurred,. Verify that the specified PRO tip has not been deleted.

    11009, DRAWING ERROR, Runtime error # 11009 is a drawing error that may indicate that the DirectX drivers on your machine do not. These are standard operating system commands that Windows will execute even when E- Prime is running. 11041, IMAGEDISPLAY INTERNAL ERROR HAS OCCURRED, This error indicates that the specified image file could not be loaded, either. An error has occurred. \ r\ n em System. CompilerServices. " None of the specified endpoints were reachable",. Backup to a remote storage location with Veritas System Recovery ( VSR) reports EBAB03F1: Following operating system error occurred while performing the. · CrystalReportsException: Load report failed - The system. COMException: The system cannot find the path specified.